make: Target 'all' not remade because of errors.
testthat/vendor/catch.h:6495:33: error: size of array ‘altStackMem’ is not an integral constant-expression
testthat/vendor/catch.h:6546:45: error: size of array ‘altStackMem’ is not an integral constant-expression
make[1]: *** [/opt/R/4.0.5/lib/R/etc/Makeconf:181: test-runner.o] Error 1
gcc (Debian 14.2.0-19) 14.2.0
